(naphthalene)5 radical anion

Gas phase ion energetics data

Data compiled by: John E. Bartmess

Electron affinity of neutral species

EAneutral (eV) Method Reference Comment
0.620 ± 0.030LPESSong, Han, et al., 2002Stated electron affinity is the Vertical Detachment Energy
0.35 ± 0.10LPESAndo, Mitsui, et al., 2008Stated electron affinity is the Vertical Detachment Energy

References

Song, Han, et al., 2002
Song, J.K.; Han, S.Y.; Chu, I.H.; Kim, J.H.; Kim, S.K.; Lyapustina, S.A.; Xu, S.J.; Nilles, J.M.; Bowen, K.H., Photoelectron spectroscopy of naphthalene cluster anions, J. Chem. Phys., 2002, 116, 11, 4477-4481, https://doi.org/10.1063/1.1449869 . [all data]

Ando, Mitsui, et al., 2008
Ando, N.; Mitsui, M.; Nakajima, A., Photoelectron spectroscopy of cluster anions of naphthalene and related aromatic hydrocarbons, J. Chem. Phys., 2008, 128, 15, 154318, https://doi.org/10.1063/1.2903473 . [all data]