oCl-phenoxide anion

Reaction thermochemistry data

Data compiled by: John E. Bartmess

Individual Reactions

C6H4ClO- + Hydrogen cation = Phenol, 2-chloro-

By formula: C6H4ClO- + H+ = C6H5ClO

Quantity Value Units Method Reference Comment
Δr343.4 ± 2.3kcal/molG+TSKebarle and McMahon, 1977gas phase
Quantity Value Units Method Reference Comment
Δr337.1 ± 2.0kcal/molIMREKebarle and McMahon, 1977gas phase

References

Kebarle and McMahon, 1977
Kebarle, P.; McMahon, T.B., Intrinsic Acidities of Substituted Phenols and Benzoic Acids Determined by Gas Phase Proton Transfer Equilibria, J. Am. Chem. Soc., 1977, 99, 7, 2222, https://doi.org/10.1021/ja00449a032 . [all data]