V14O2 radical anion

Gas phase ion energetics data

Data compiled by: John E. Bartmess

Electron affinity of neutral species

EAneutral (eV) Method Reference Comment
1.43 ± 0.14LPESPramann, Koyasu, et al., 2002Vertical Detachment Energy: 1.77±0.05 eV

References

Pramann, Koyasu, et al., 2002
Pramann, A.; Koyasu, K.; Nakajima, A.; Kaya, K., Anion photoelectron spectroscopy of VnOm- (n=4-15; m=0-2), J. Chem. Phys., 2002, 116, 15, 6521-6528, https://doi.org/10.1063/1.1461824 . [all data]