(H2O)2..COS radical anion

Reaction thermochemistry data

Data compiled by: John E. Bartmess

Individual Reactions

CH2O2S- + 2Water = CH4O3S-

By formula: CH2O2S- + 2H2O = CH4O3S-

Quantity Value Units Method Reference Comment
Δr10.7 ± 2.0kcal/molN/ASurber and Sanov, 2002gas phase; Stated electron affinity is the Vertical Detachment Energy

Gas phase ion energetics data

Data compiled by: John E. Bartmess

Electron affinity of neutral species

EAneutral (eV) Method Reference Comment
2.530 ± 0.070LPESSurber and Sanov, 2002Stated electron affinity is the Vertical Detachment Energy

Ion clustering data

Data compiled by: John E. Bartmess

Clustering reactions

CH2O2S- + 2Water = CH4O3S-

By formula: CH2O2S- + 2H2O = CH4O3S-

Quantity Value Units Method Reference Comment
Δr10.7 ± 2.0kcal/molN/ASurber and Sanov, 2002gas phase; Stated electron affinity is the Vertical Detachment Energy

References

Surber and Sanov, 2002
Surber, E.; Sanov, A., Photoelectron imaging spectroscopy of molecular and cluster anions: CS2- and OCS-(H2O)(1,2), J. Chem. Phys., 2002, 116, 14, 5921-5924, https://doi.org/10.1063/1.1467916 . [all data]