Me2NH..H anion

Gas phase ion energetics data

Data compiled by: John E. Bartmess

Electron affinity of neutral species

EAneutral (eV) Method Reference Comment
1.10 ± 0.10LPESRadisic, Xu, et al., 2002Stated electron affinity is the Vertical Detachment Energy

References

Radisic, Xu, et al., 2002
Radisic, D.; Xu, S.J.; Bowen, K.H., Photoelectron spectroscopy of the anions, CH3NH- and (CH3)(2)N- and the anion complexes, H-(CH3NH2) and (CH3)(2)N-[(CH3)(2)NH), Chem. Phys. Lett., 2002, 354, 1-2, 9-13, https://doi.org/10.1016/S0009-2614(01)01470-1 . [all data]