pCHO-phenoxide anion

Gas phase ion energetics data

Data compiled by: John E. Bartmess

Protonation reactions

C7H5O2- + Hydrogen cation = Benzaldehyde, 4-hydroxy-

By formula: C7H5O2- + H+ = C7H6O2

Quantity Value Units Method Reference Comment
Δr333.0 ± 2.1kcal/molG+TSFujio, McIver, et al., 1981gas phase; value altered from reference due to change in acidity scale
Quantity Value Units Method Reference Comment
Δr326.1 ± 2.0kcal/molIMREFujio, McIver, et al., 1981gas phase; value altered from reference due to change in acidity scale

References

Fujio, McIver, et al., 1981
Fujio, M.; McIver, R.T., Jr.; Taft, R.W., Effects on the acidities of phenols from specific substituent-solvent interactions. Inherent substituent parameters from gas phase acidities, J. Am. Chem. Soc., 1981, 103, 4017. [all data]