coronene..Ti anion

Gas phase ion energetics data

Data compiled by: John E. Bartmess

Electron affinity of neutral species

EAneutral (eV) Method Reference Comment
1.310 ± 0.060LPESDuncan, Knight, et al., 2001

References

Duncan, Knight, et al., 2001
Duncan, M.A.; Knight, A.M.; Negishi, Y.; Nagao, S.; Judai, K.; Nakajima, A.; Kaya, K., Photoelectron spectroscopy of V-x(coronene)(y) and Ti- x(coronene)(y) anions, J. Phys. Chem. A, 2001, 105, 44, 10093-10097, https://doi.org/10.1021/jp0122676 . [all data]