Fe3O3 anion

Gas phase ion energetics data

Data compiled by: John E. Bartmess

Electron affinity of neutral species

EAneutral (eV) Method Reference Comment
2.190 ± 0.060LPESWang, Wu, et al., 1996

References

Wang, Wu, et al., 1996
Wang, L.S.; Wu, H.; Desai, S.R., Sequential Oxygen Atom Chemisorption on Surfaces of Small Iron Clusters, Phys. Rev. Lett., 1996, 76, 25, 4853, https://doi.org/10.1103/PhysRevLett.76.4853 . [all data]