V60 anion

Gas phase ion energetics data

Data compiled by: John E. Bartmess

Electron affinity of neutral species

EAneutral (eV) Method Reference Comment
2.630 ± 0.080LPESWu, Desai, et al., 1996

References

Wu, Desai, et al., 1996
Wu, H.; Desai, S.R.; Wang, L., Evolution of the Electronic Structure of Small Vanadium Clusters from Molecular to Bulklike, Phys. Rev. Lett. (1996), 1996, 77, 12, 2436, https://doi.org/10.1103/PhysRevLett.77.2436 . [all data]