pMe-phenoxide anion

Reaction thermochemistry data

Data compiled by: John E. Bartmess

Individual Reactions

C7H7O- + Hydrogen cation = p-Cresol

By formula: C7H7O- + H+ = C7H8O

Quantity Value Units Method Reference Comment
Δr1465. ± 8.8kJ/molG+TSFujio, McIver, et al., 1981gas phase; value altered from reference due to change in acidity scale
Δr1465. ± 8.8kJ/molG+TSBartmess, Scott, et al., 1979gas phase; value altered from reference due to change in acidity scale
Δr1471. ± 9.6kJ/molG+TSKebarle and McMahon, 1977gas phase
Quantity Value Units Method Reference Comment
Δr1437. ± 8.4kJ/molIMREFujio, McIver, et al., 1981gas phase; value altered from reference due to change in acidity scale
Δr1437. ± 8.4kJ/molIMREBartmess, Scott, et al., 1979gas phase; value altered from reference due to change in acidity scale
Δr1442. ± 8.4kJ/molIMREKebarle and McMahon, 1977gas phase

Gas phase ion energetics data

Data compiled by: John E. Bartmess

Electron affinity of neutral species

EAneutral (eV) Method Reference Comment
2.17 ± 0.11D-EAFujio, McIver, et al., 1981value altered from reference due to change in acidity scale

Protonation reactions

C7H7O- + Hydrogen cation = p-Cresol

By formula: C7H7O- + H+ = C7H8O

Quantity Value Units Method Reference Comment
Δr1465. ± 8.8kJ/molG+TSFujio, McIver, et al., 1981gas phase; value altered from reference due to change in acidity scale
Δr1465. ± 8.8kJ/molG+TSBartmess, Scott, et al., 1979gas phase; value altered from reference due to change in acidity scale
Δr1471. ± 9.6kJ/molG+TSKebarle and McMahon, 1977gas phase
Quantity Value Units Method Reference Comment
Δr1437. ± 8.4kJ/molIMREFujio, McIver, et al., 1981gas phase; value altered from reference due to change in acidity scale
Δr1437. ± 8.4kJ/molIMREBartmess, Scott, et al., 1979gas phase; value altered from reference due to change in acidity scale
Δr1442. ± 8.4kJ/molIMREKebarle and McMahon, 1977gas phase

References

Fujio, McIver, et al., 1981
Fujio, M.; McIver, R.T., Jr.; Taft, R.W., Effects on the acidities of phenols from specific substituent-solvent interactions. Inherent substituent parameters from gas phase acidities, J. Am. Chem. Soc., 1981, 103, 4017. [all data]

Bartmess, Scott, et al., 1979
Bartmess, J.E.; Scott, J.A.; McIver, R.T., Jr., The gas phase acidity scale from methanol to phenol, J. Am. Chem. Soc., 1979, 101, 6047. [all data]

Kebarle and McMahon, 1977
Kebarle, P.; McMahon, T.B., Intrinsic Acidities of Substituted Phenols and Benzoic Acids Determined by Gas Phase Proton Transfer Equilibria, J. Am. Chem. Soc., 1977, 99, 7, 2222, https://doi.org/10.1021/ja00449a032 . [all data]