DCO2 anion

Gas phase ion energetics data

Data compiled by: John E. Bartmess

Electron affinity of neutral species

EAneutral (eV) Method Reference Comment
3.516 ± 0.010LPESGarand, Klein, et al., 2010
3.510 ± 0.015LPESKim, Bradforth, et al., 1995

References

Garand, Klein, et al., 2010
Garand, E.; Klein, K.; Stanton, J.F.; Zhou, J.; Yacovitch, T.I.; Neumark, D.M., Vibronic Structure of the Formyloxyl Radical (HCO2) via Slow Photoelectron Velocity-Map Imaging Spectroscopy and Model Hamiltonian Calculations, J. Phys. Chem. A, 2010, 114, 3, 1374-1383, https://doi.org/10.1021/jp9067894 . [all data]

Kim, Bradforth, et al., 1995
Kim, E.H.; Bradforth, S.E.; Arnold, D.W.; Metz, R.B.; Neumark, D.M., Study of HCO2 and DCO2 by Negative Ion Photoelectron Spectroscopy, J. Chem. Phys., 1995, 103, 18, 7801, https://doi.org/10.1063/1.470196 . [all data]