TiC3 anion

Gas phase ion energetics data

Data compiled by: John E. Bartmess

Electron affinity of neutral species

EAneutral (eV) Method Reference Comment
1.561 ± 0.015LPESWang, Ding, et al., 1997

References

Wang, Ding, et al., 1997
Wang, X.; Ding, C.; Wang, L.S., Vibrationally Resolved Photoelectron Spectra of TiCx-(x=2-5) Clusters, J. Phys. Chem., 1997, 101, 42, 7699, https://doi.org/10.1021/jp971838k . [all data]