OCuO(O2) anion

Gas phase ion energetics data

Data compiled by: John E. Bartmess

Electron affinity of neutral species

EAneutral (eV) Method Reference Comment
3.530 ± 0.040LPESWu, Desai, et al., 1997

References

Wu, Desai, et al., 1997
Wu, H.; Desai, S.R.; Wang, L., Chemical Bonding between Cu and Oxygen - Copper Oxides versus O2 Complexes: A Study of CuOx(x=0-6) Species by Anion Photoelectron Spectroscopy, J. Phys. Chem., 1997, 101, 11, 2103, https://doi.org/10.1021/jp9631442 . [all data]