Ti40 anion

Gas phase ion energetics data

Data compiled by: John E. Bartmess

Electron affinity of neutral species

EAneutral (eV) Method Reference Comment
2.330 ± 0.080LPESWu, Desai, et al., 1996

References

Wu, Desai, et al., 1996
Wu, H.; Desai, S.R.; Wang, L., Electronic Structure of Small Titanium Clusters: Emergence and Evolution of the 3d Band, Phys. Rev. Lett. (1996), 1996, 76, 2, 212, https://doi.org/10.1103/PhysRevLett.76.212 . [all data]