(tBu)2CHO anion

Reaction thermochemistry data

Data compiled by: John E. Bartmess

Individual Reactions

C9H19O- + Hydrogen cation = 3-Pentanol, 2,2,4,4-tetramethyl-

By formula: C9H19O- + H+ = C9H20O

Quantity Value Units Method Reference Comment
Δr1538. ± 8.8kJ/molG+TSBartmess, Scott, et al., 1979gas phase; value altered from reference due to change in acidity scale
Quantity Value Units Method Reference Comment
Δr1510. ± 8.4kJ/molIMREBartmess, Scott, et al., 1979gas phase; value altered from reference due to change in acidity scale

Gas phase ion energetics data

Data compiled by: John E. Bartmess

Electron affinity of neutral species

EAneutral (eV) Method Reference Comment
2.17 ± 0.13D-EABartmess, Scott, et al., 1979value altered from reference due to change in acidity scale

Protonation reactions

C9H19O- + Hydrogen cation = 3-Pentanol, 2,2,4,4-tetramethyl-

By formula: C9H19O- + H+ = C9H20O

Quantity Value Units Method Reference Comment
Δr1538. ± 8.8kJ/molG+TSBartmess, Scott, et al., 1979gas phase; value altered from reference due to change in acidity scale
Quantity Value Units Method Reference Comment
Δr1510. ± 8.4kJ/molIMREBartmess, Scott, et al., 1979gas phase; value altered from reference due to change in acidity scale

References

Bartmess, Scott, et al., 1979
Bartmess, J.E.; Scott, J.A.; McIver, R.T., Jr., The gas phase acidity scale from methanol to phenol, J. Am. Chem. Soc., 1979, 101, 6047. [all data]