Ge2F3 radical anion

Gas phase ion energetics data

Data compiled by: John E. Bartmess

Electron affinity of neutral species

EAneutral (eV) Method Reference Comment
1.970 ± 0.080LPESNeigishi, Kawamata, et al., 1997Vertical Detachment Energy: 2.24±0.05 eV

References

Neigishi, Kawamata, et al., 1997
Neigishi, Y.; Kawamata, H.; Hayase, T.; Gomei, M.; Kishi, R.; Hayakawa, F.; Nakajima, A.; Kaya, K., Photoelectron Spectroscopy of Germanium-Fluorine Binary Cluster Anions: the HOMO-LUMO Gap Estimation of Gen Clusters., Chem. Phys. Lett., 1997, 269, 3-4, 199-207, https://doi.org/10.1016/S0009-2614(97)00284-4 . [all data]