MgH anion

Gas phase thermochemistry data

Data compiled by: John E. Bartmess

Quantity Value Units Method Reference Comment
Δfgas128. ± 8.4kJ/molR-EARackwitz, Feldman, et al., 1977Caln: ΔHacid=363.8 Hinde, 2000

Reaction thermochemistry data

Data compiled by: John E. Bartmess

Individual Reactions

HMg- + Hydrogen cation = magnesium dihydride

By formula: HMg- + H+ = H2Mg

Quantity Value Units Method Reference Comment
Δr1503. ± 10.kJ/molD-EARackwitz, Feldman, et al., 1977gas phase; Caln: ΔHacid=363.8 Hinde, 2000

References

Rackwitz, Feldman, et al., 1977
Rackwitz, R.; Feldman, D.; Kaiser, H.J.; Heincke, E., Photodetachment bei einigen zweiatomigen negativen hydridionen: BeH-, MgH-, CaH-, ZnH-, PH-, AsH-, Z. Naturforsch. A:, 1977, 32, 594. [all data]

Hinde, 2000
Hinde, R.J., Ab initio gas-phase acidities of NaH, MgH2, and AlH3, J. Phys. Chem. A, 2000, 104, 32, 7580-7585, https://doi.org/10.1021/jp994138j . [all data]