Co13 radical anion

Gas phase ion energetics data

Data compiled by: John E. Bartmess

Electron affinity of neutral species

EAneutral (eV) Method Reference Comment
2.240 ± 0.050LPESLiu, Zhai, et al., 2001
1.99 ± 0.22LPESPramann, Koyasu, et al., 2002Vertical Detachment Energy: 1.35±0.22 eV

References

Liu, Zhai, et al., 2001
Liu, S.R.; Zhai, H.J.; Wang, L.S., Electronic and structural evolution of Co-n clusters (n=1-108) by photoelectron spectroscopy - art. no. 153402, Phys. Rev. B: Cond. Matt., 2001, 64, 15, 3402, https://doi.org/10.1103/PhysRevB.64.153402 . [all data]

Pramann, Koyasu, et al., 2002
Pramann, A.; Koyasu, K.; Nakajima, A.; Kaya, K., Photoelectron spectroscopy of cobalt oxide cluster anions, J. Phys. Chem. A, 2002, 106, 19, 4891-4896, https://doi.org/10.1021/jp020247d . [all data]