(NH3)3..Na radical anion

Gas phase ion energetics data

Data compiled by: John E. Bartmess

Electron affinity of neutral species

EAneutral (eV) Method Reference Comment
0.410 ± 0.050LPESTakasu, Ito, et al., 2000Stated electron affinity is the Vertical Detachment Energy
0.38 ± 0.10LPESTakasu, Misaizu, et al., 1997Stated electron affinity is the Vertical Detachment Energy

References

Takasu, Ito, et al., 2000
Takasu, R.; Ito, H.; Nishikawa, K.; Hashimoto, K.; Okuda, R.; Fuke, K., Solvation Process of Nam in Small Ammonia Clusters: Photoelectron Spectroscopy of Na(m)-(NH3)n, (m=3), J. Electron Spectros. Rel. Phenom., 2000, 106, 2-3, 127-139, https://doi.org/10.1016/S0368-2048(99)00071-7 . [all data]

Takasu, Misaizu, et al., 1997
Takasu, R.; Misaizu, F.; Hashimoto, K.; Fuke, K., Microscopic Solvation Process of Alkali Atoms in Finite Clusters: Photoelectron and Photoionization Studies of M(H2O)n and M(NH3)n(M= Li, Li-, Na-), J. Phys. Chem. A, 1997, 101, 17, 3078, https://doi.org/10.1021/jp9629654 . [all data]