2,3,5,6-tetraCF3-phenide anion

Reaction thermochemistry data

Data compiled by: John E. Bartmess

Individual Reactions

C10HF12- + Hydrogen cation = C10H2F12

By formula: C10HF12- + H+ = C10H2F12

Quantity Value Units Method Reference Comment
Δr1463. ± 13.kJ/molG+TSSchlosser, Mongin, et al., 1998gas phase
Quantity Value Units Method Reference Comment
Δr1428. ± 13.kJ/molIMRESchlosser, Mongin, et al., 1998gas phase

Gas phase ion energetics data

Data compiled by: John E. Bartmess

Protonation reactions

C10HF12- + Hydrogen cation = C10H2F12

By formula: C10HF12- + H+ = C10H2F12

Quantity Value Units Method Reference Comment
Δr1463. ± 13.kJ/molG+TSSchlosser, Mongin, et al., 1998gas phase
Quantity Value Units Method Reference Comment
Δr1428. ± 13.kJ/molIMRESchlosser, Mongin, et al., 1998gas phase

References

Schlosser, Mongin, et al., 1998
Schlosser, M.; Mongin, F.; Porwisiak, J.; Dmowski, W.; Buker, H.H.; Nibbering, N.M.M., Bis- and Oligo(trifluoromethyl)benzenes: Hydrogen/Metal Exchange Rates and Gas-Phase Acidities., Chem. Eur. J., 1998, 4, 7, 1281, https://doi.org/10.1002/(SICI)1521-3765(19980710)4:7<1281::AID-CHEM1281>3.0.CO;2-I . [all data]