D2O..O radical anion

Gas phase thermochemistry data

Data compiled by: John E. Bartmess

Quantity Value Units Method Reference Comment
Δfgas-238.4kJ/molTherDeyerl, Clements, et al., 2001

Reaction thermochemistry data

Data compiled by: John E. Bartmess

Individual Reactions

O- + Deuterium oxide = D2O2-

By formula: O- + D2O = D2O2-

Quantity Value Units Method Reference Comment
Δr101. ± 7.5kJ/molPDisDeyerl, Clements, et al., 2001gas phase

D2O2- + 2Deuterium oxide = D4O3-

By formula: D2O2- + 2D2O = D4O3-

Quantity Value Units Method Reference Comment
Δr78.2 ± 7.5kJ/molLPESClements, Luong, et al., 2001gas phase

References

Deyerl, Clements, et al., 2001
Deyerl, H.J.; Clements, T.G.; Luong, A.K.; Continetti, R.E., Transition state dynamics of the OH+OH - O+H2O reaction studied by dissociative photodetachment of H2O2-, J. Chem. Phys., 2001, 115, 15, 6931-6940, https://doi.org/10.1063/1.1404148 . [all data]

Clements, Luong, et al., 2001
Clements, T.G.; Luong, A.K.; Deyerl, H.J.; Continetti, R.E., Dissociative photodetachment studies of O-(H2O)(2), OH- (H2O)(2), and the deuterated isotopomers: Energetics and three- body dissociation dynamics, J. Chem. Phys., 2001, 114, 19, 8436-8444, https://doi.org/10.1063/1.1366332 . [all data]