CH2=C(NH2)O anion

Reaction thermochemistry data

Data compiled by: John E. Bartmess

Individual Reactions

C2H4NO- + Hydrogen cation = Acetamide

By formula: C2H4NO- + H+ = C2H5NO

Quantity Value Units Method Reference Comment
Δr1561. ± 13.kJ/molG+TSHare, Marimanikkuppam, et al., 2001gas phase
Quantity Value Units Method Reference Comment
Δr1527. ± 13.kJ/molIMRBHare, Marimanikkuppam, et al., 2001gas phase

Gas phase ion energetics data

Data compiled by: John E. Bartmess

Electron affinity of neutral species

EAneutral (eV) Method Reference Comment
1.50 ± 0.19D-EAHare, Marimanikkuppam, et al., 2001

Protonation reactions

C2H4NO- + Hydrogen cation = Acetamide

By formula: C2H4NO- + H+ = C2H5NO

Quantity Value Units Method Reference Comment
Δr1561. ± 13.kJ/molG+TSHare, Marimanikkuppam, et al., 2001gas phase
Quantity Value Units Method Reference Comment
Δr1527. ± 13.kJ/molIMRBHare, Marimanikkuppam, et al., 2001gas phase

References

Hare, Marimanikkuppam, et al., 2001
Hare, M.C.; Marimanikkuppam, S.S.; Kass, S.R., Acetamide enolate: formation, reactivity, and proton affinity, Int. J. Mass Spectrom., 2001, 210, 153-163, https://doi.org/10.1016/S1387-3806(01)00397-9 . [all data]