(MeOCF3)2..Cl anion

Reaction thermochemistry data

Data compiled by: John E. Bartmess

Individual Reactions

C2H3ClF3O- + 2C3H3F3O- = C4H6ClF6O2-

By formula: C2H3ClF3O- + 2C3H3F3O- = C4H6ClF6O2-

Quantity Value Units Method Reference Comment
Δr53.1 ± 1.7kJ/molN/ABogdanov, Lee, et al., 2001gas phase
Quantity Value Units Method Reference Comment
Δr23. ± 4.2kJ/molTDAsBogdanov, Lee, et al., 2001gas phase

References

Bogdanov, Lee, et al., 2001
Bogdanov, B.; Lee, H.J.S.; McMahon, T.B., Influence of fluorine substitution on the structures and thermochemistry of chloride ion-ether complexes in the gas phase, Int. J. Mass Spectrom., 2001, 210, 387-402, https://doi.org/10.1016/S1387-3806(01)00404-3 . [all data]