CD3OO anion

Gas phase ion energetics data

Data compiled by: John E. Bartmess

Electron affinity of neutral species

EAneutral (eV) Method Reference Comment
1.1540 ± 0.0040LPESBlanksby, Ramond, et al., 2001
1.1860 ± 0.0040N/ABlanksby, Ramond, et al., 2001

References

Blanksby, Ramond, et al., 2001
Blanksby, S.J.; Ramond, T.M.; Davico, G.E.; Nimlos, M.R.; Kato, S.; Bierbaum, V.M.; Lineberger, W.C.; Ellison, Negative-ion photoelectron spectroscopy, gas-phase acidity, and thermochemistry of the peroxyl radicals CH3OO and CH3CH2OO, J. Am. Chem. Soc., 2001, 123, 39, 9585-9596, https://doi.org/10.1021/ja010942j . [all data]