NaCl2 anion

Gas phase ion energetics data

Data compiled by: John E. Bartmess

Electron affinity of neutral species

EAneutral (eV) Method Reference Comment
5.60 ± 0.10LPESAlexandrova, Boldyrev, et al., 2004Stated electron affinity is the Vertical Detachment Energy
5.860 ± 0.060LPESWang, Ding, et al., 1999Stated electron affinity is the Vertical Detachment Energy

References

Alexandrova, Boldyrev, et al., 2004
Alexandrova, A.N.; Boldyrev, A.I.; Fu, Y.-J.; Yang, X.; Wang, X.-B.; Wang, L.-S., Structure of the NaxCl-x+a(x=1-4) clusters via ab initio genetic algorithm and photoelectron spectroscopy, J. Chem. Phys., 2004, 121, 12, 5709, https://doi.org/10.1063/1.1783276 . [all data]

Wang, Ding, et al., 1999
Wang, X.B.; Ding, C.F.; Wang, L.S.; Boldyrev, A.I.; Simons, J., First experimental photoelectron spectra of superhalogens and their theoretical interpretations, J. Chem. Phys., 1999, 110, 10, 4763-4771, https://doi.org/10.1063/1.478386 . [all data]