(MeCl)3..Cl anion

Gas phase thermochemistry data

Data compiled by: John E. Bartmess

Quantity Value Units Method Reference Comment
Δfgas-598.06kJ/molTherHiraoka, Mizuno, et al., 2001

Reaction thermochemistry data

Data compiled by: John E. Bartmess

Individual Reactions

C2H6Cl3- + 3Chloromethane = C3H9Cl4-

By formula: C2H6Cl3- + 3CH3Cl = C3H9Cl4-

Quantity Value Units Method Reference Comment
Δr35.1kJ/molN/AHiraoka, Mizuno, et al., 2001gas phase
Quantity Value Units Method Reference Comment
Δr8.95kJ/molTDAsHiraoka, Mizuno, et al., 2001gas phase

C3H9Cl4- + 4Chloromethane = C4H12Cl5-

By formula: C3H9Cl4- + 4CH3Cl = C4H12Cl5-

Quantity Value Units Method Reference Comment
Δr31.8kJ/molN/AHiraoka, Mizuno, et al., 2001gas phase
Quantity Value Units Method Reference Comment
Δr5.61kJ/molTDAsHiraoka, Mizuno, et al., 2001gas phase

Ion clustering data

Data compiled by: John E. Bartmess

Clustering reactions

C2H6Cl3- + 3Chloromethane = C3H9Cl4-

By formula: C2H6Cl3- + 3CH3Cl = C3H9Cl4-

Quantity Value Units Method Reference Comment
Δr8.40kcal/molN/AHiraoka, Mizuno, et al., 2001gas phase
Quantity Value Units Method Reference Comment
Δr2.14kcal/molTDAsHiraoka, Mizuno, et al., 2001gas phase

C3H9Cl4- + 4Chloromethane = C4H12Cl5-

By formula: C3H9Cl4- + 4CH3Cl = C4H12Cl5-

Quantity Value Units Method Reference Comment
Δr7.60kcal/molN/AHiraoka, Mizuno, et al., 2001gas phase
Quantity Value Units Method Reference Comment
Δr1.34kcal/molTDAsHiraoka, Mizuno, et al., 2001gas phase

References

Hiraoka, Mizuno, et al., 2001
Hiraoka, K.; Mizuno, T.; Iino, T.; Eguchi, D.; Yamabe, S., Characteristic changes of bond energies for gas-phase cluster ions of halide ions with methane and chloromethanes, J. Phys. Chem. A, 2001, 105, 20, 4887-4893, https://doi.org/10.1021/jp010143n . [all data]