(CH4)8..F anion

Gas phase thermochemistry data

Data compiled by: John E. Bartmess

Quantity Value Units Method Reference Comment
Δfgas-1004.0kJ/molTherHiraoka, Mizuno, et al., 2001

Reaction thermochemistry data

Data compiled by: John E. Bartmess

Individual Reactions

C7H28F- + 8Methane = C8H32F-

By formula: C7H28F- + 8CH4 = C8H32F-

Quantity Value Units Method Reference Comment
Δr12.1kJ/molN/AHiraoka, Mizuno, et al., 2001gas phase
Quantity Value Units Method Reference Comment
Δr-15.3kJ/molTDAsHiraoka, Mizuno, et al., 2001gas phase

C8H32F- + 9Methane = C9H36F-

By formula: C8H32F- + 9CH4 = C9H36F-

Quantity Value Units Method Reference Comment
Δr9.62kJ/molN/AHiraoka, Mizuno, et al., 2001gas phase
Quantity Value Units Method Reference Comment
Δr-16.6kJ/molTDAsHiraoka, Mizuno, et al., 2001gas phase

Ion clustering data

Data compiled by: John E. Bartmess

Clustering reactions

C7H28F- + 8Methane = C8H32F-

By formula: C7H28F- + 8CH4 = C8H32F-

Quantity Value Units Method Reference Comment
Δr12.1kJ/molN/AHiraoka, Mizuno, et al., 2001gas phase
Quantity Value Units Method Reference Comment
Δr-15.3kJ/molTDAsHiraoka, Mizuno, et al., 2001gas phase

C8H32F- + 9Methane = C9H36F-

By formula: C8H32F- + 9CH4 = C9H36F-

Quantity Value Units Method Reference Comment
Δr9.62kJ/molN/AHiraoka, Mizuno, et al., 2001gas phase
Quantity Value Units Method Reference Comment
Δr-16.6kJ/molTDAsHiraoka, Mizuno, et al., 2001gas phase

References

Hiraoka, Mizuno, et al., 2001
Hiraoka, K.; Mizuno, T.; Iino, T.; Eguchi, D.; Yamabe, S., Characteristic changes of bond energies for gas-phase cluster ions of halide ions with methane and chloromethanes, J. Phys. Chem. A, 2001, 105, 20, 4887-4893, https://doi.org/10.1021/jp010143n . [all data]