NaCAl4 anion

Gas phase ion energetics data

Data compiled by: John E. Bartmess

Electron affinity of neutral species

EAneutral (eV) Method Reference Comment
2.020 ± 0.060LPESLi, Zhang, et al., 2000Vertical Detachment Energy: 2.12±0.03 eV

References

Li, Zhang, et al., 2000
Li, X.; Zhang, H.F.; Wang, L.S.; Geske, G.D.; Boldyrev, A.I., Pentaatomic tetracoordinate planar carbon, [CAl4](2-): A new structural unit and its salt complexes, Angew. Chem. Intl. Ed. Engl., 2000, 39, 20, 3630-3633, https://doi.org/10.1002/1521-3773(20001016)39:20<3630::AID-ANIE3630>3.0.CO;2-R . [all data]