CAl3Ge anion

Gas phase ion energetics data

Data compiled by: John E. Bartmess

Electron affinity of neutral species

EAneutral (eV) Method Reference Comment
2.700 ± 0.060LPESLi, Zhai, et al., 2002done colder than Wang, Boldyrev, et al., 2000
2.780 ± 0.040LPESWang, Boldyrev, et al., 2000Stated electron affinity is the Vertical Detachment Energy

References

Li, Zhai, et al., 2002
Li, X.; Zhai, H.J.; Wang, L.S., Photoelectron spectroscopy of pentaatomic tetracoordinate planar carbon molecules: CAl3Si- and CAl3Ge-, Chem. Phys., 2002, 357, 415-419. [all data]

Wang, Boldyrev, et al., 2000
Wang, L.S.; Boldyrev, A.I.; Li, X.; Simons, J., Experimental observation of pentaatomic tetracoordinate planar carbon-containing molecules, J. Am. Chem. Soc., 2000, 122, 32, 7681-7687, https://doi.org/10.1021/ja993081b . [all data]