AlC2 anion

Gas phase ion energetics data

Data compiled by: John E. Bartmess

Electron affinity of neutral species

EAneutral (eV) Method Reference Comment
2.650 ± 0.030LPESBoldyrev, Simons, et al., 1999Vertical Detachment Energy: 2.73±0.03 eV

Gas phase thermochemistry data

Data compiled by: John E. Bartmess

Quantity Value Units Method Reference Comment
Δfgas100.4 ± 8.4kcal/molR-EABoldyrev, Simons, et al., 1999Vertical Detachment Energy: 2.73±0.03 eV

References

Boldyrev, Simons, et al., 1999
Boldyrev, A.I.; Simons, J.; Li, X.; Wang, L.S., pi- and sigma-coordinated Al in AlC2- and AlCSi-. A combined photoelectron spectroscopy and ab initio study, J. Am. Chem. Soc., 1999, 121, 43, 10193-10197, https://doi.org/10.1021/ja992102z . [all data]