mCF3-C6H5SiMe2 anion

Reaction thermochemistry data

Data compiled by: John E. Bartmess

Individual Reactions

C9H10F3Si- + Hydrogen cation = C9H11F3Si

By formula: C9H10F3Si- + H+ = C9H11F3Si

Quantity Value Units Method Reference Comment
Δr376.1 ± 2.2kcal/molG+TSIrie, Kikukawa, et al., 2001gas phase; The anion may be ArSiH(Me)CH2-, based on LFER size and ab initio calculations - JEB
Quantity Value Units Method Reference Comment
Δr368.4 ± 2.0kcal/molIMREIrie, Kikukawa, et al., 2001gas phase; The anion may be ArSiH(Me)CH2-, based on LFER size and ab initio calculations - JEB

References

Irie, Kikukawa, et al., 2001
Irie, M.; Kikukawa, K.; Shimizu, N.; Mishima, M., Gas-phase acidities of aryldimethylsilanes, J. Chem. Soc. Perkin Trans., 2001, 2, 6, 923-928, https://doi.org/10.1039/b100488n . [all data]