pCl-C6H5SiMe2 anion

Reaction thermochemistry data

Data compiled by: John E. Bartmess

Individual Reactions

C8H10ClSi- + Hydrogen cation = C8H11ClSi

By formula: C8H10ClSi- + H+ = C8H11ClSi

Quantity Value Units Method Reference Comment
Δr376.7 ± 2.2kcal/molG+TSIrie, Kikukawa, et al., 2001gas phase; The anion may be ArSiH(Me)CH2-, based on LFER size and ab initio calculations - JEB
Quantity Value Units Method Reference Comment
Δr369.0 ± 2.0kcal/molIMREIrie, Kikukawa, et al., 2001gas phase; The anion may be ArSiH(Me)CH2-, based on LFER size and ab initio calculations - JEB

References

Irie, Kikukawa, et al., 2001
Irie, M.; Kikukawa, K.; Shimizu, N.; Mishima, M., Gas-phase acidities of aryldimethylsilanes, J. Chem. Soc. Perkin Trans., 2001, 2, 6, 923-928, https://doi.org/10.1039/b100488n . [all data]