(Ar)15..Cl anion

Gas phase ion energetics data

Data compiled by: John E. Bartmess

Electron affinity of neutral species

EAneutral (eV) Method Reference Comment
4.1130 ± 0.0062ZEKELenzer, Yourshaw, et al., 2001Given: 33173.5(50.0) cm-1

References

Lenzer, Yourshaw, et al., 2001
Lenzer, T.; Yourshaw, I.; Furlanetto, M.R.; Pivonka, N.L.; Neumark, D.M., Characterization of ArnCl(-) clusters (n=2-15) using zero electron kinetic energy and partially discriminated threshold photodetachment spectroscopy, J. Chem. Phys., 2001, 115, 8, 3578-3589, https://doi.org/10.1063/1.1388202 . [all data]