Ga9P7 radical anion

Gas phase ion energetics data

Data compiled by: John E. Bartmess

Electron affinity of neutral species

EAneutral (eV) Method Reference Comment
3.00 ± 0.15LPESTaylor, Asmis, et al., 1998Vertical Detachment Energy: 3.23±0.06 eV

References

Taylor, Asmis, et al., 1998
Taylor, T.R.; Asmis, K.R.; Xu, C.S.; Neumark, D.M., Evolution of Electronic Structure as a Function of Size in Gallium Phosphide Semiconductor Clusters., Chem. Phys. Lett., 1998, 297, 1-2, 133, https://doi.org/10.1016/S0009-2614(98)01104-X . [all data]