GaP radical anion

Gas phase ion energetics data

Data compiled by: John E. Bartmess

Electron affinity of neutral species

EAneutral (eV) Method Reference Comment
1.988 ± 0.010ZEKEGomez, Taylor, et al., 2002
1.960 ± 0.075LPESTaylor, Asmis, et al., 1998Vertical Detachment Energy: 2.11±0.06 eV

References

Gomez, Taylor, et al., 2002
Gomez, H.; Taylor, T.R.; Zhao, Y.; Neumark, D.M., Spectroscopy of the low-lying states of the group III-V diatomics, AlP, GaP, InP, and GaAs via anion photodetachment spectroscopy, J. Chem. Phys., 2002, 117, 19, 8644-8656, https://doi.org/10.1063/1.1514050 . [all data]

Taylor, Asmis, et al., 1998
Taylor, T.R.; Asmis, K.R.; Xu, C.S.; Neumark, D.M., Evolution of Electronic Structure as a Function of Size in Gallium Phosphide Semiconductor Clusters., Chem. Phys. Lett., 1998, 297, 1-2, 133, https://doi.org/10.1016/S0009-2614(98)01104-X . [all data]