CuBr2 radical anion

Gas phase ion energetics data

Data compiled by: John E. Bartmess

Electron affinity of neutral species

EAneutral (eV) Method Reference Comment
4.350 ± 0.050LPESWang, Wang, et al., 2001

References

Wang, Wang, et al., 2001
Wang, X.B.; Wang, L.S.; Brown, R.; Schwerdtfeger, P.; Schroder, D.; Schwarz, H., The electronic structure of CuCl2 and CuBr2 from anion photoelectron spectroscopy and ab initio calculations, J. Chem. Phys., 2001, 114, 17, 7388-7395, https://doi.org/10.1063/1.1362289 . [all data]