Ga2P anion

Gas phase ion energetics data

Data compiled by: John E. Bartmess

Electron affinity of neutral species

EAneutral (eV) Method Reference Comment
2.481 ± 0.015LPESTaylor, Gomez, et al., 2001
2.507 ± 0.020LPESTaylor, Asmis, et al., 1999

References

Taylor, Gomez, et al., 2001
Taylor, T.R.; Gomez, H.; Asmis, K.R.; Neumark, D.M., Photoelectron spectroscopy of GaX2-, Ga2X-, Ga2X2-, and Ga2X3- (X=P,As), J. Chem. Phys., 2001, 115, 10, 4620-4631, https://doi.org/10.1063/1.1391267 . [all data]

Taylor, Asmis, et al., 1999
Taylor, T.R.; Asmis, K.R.; Gomez, H.; Neumark, D.M., Vibrationally resolved anion photoelectron spectra of the low- lying electronic states of GaP2-, Ga2P-, and Ga2P3-, Eur. Phys. J. D, 1999, 9, 1, 317-321, https://doi.org/10.1007/s100530050447 . [all data]