(H2O)3..7-aza-indole radical anion

Gas phase ion energetics data

Data compiled by: John E. Bartmess

Electron affinity of neutral species

EAneutral (eV) Method Reference Comment
0.48 ± 0.16LPESNakajima, Negishi, et al., 1999

References

Nakajima, Negishi, et al., 1999
Nakajima, A.; Negishi, Y.; Hasumi, R.; Kaya, K., Photoelectron spectroscopy of 7-azaindole-water cluster anions, Eur. Phys. J. D, 1999, 9, 1, 303-307, https://doi.org/10.1007/s100530050444 . [all data]