H3Sn anion
- Formula: H3Sn-
- Molecular weight: 121.734

Gas phase ion energetics data

Data compiled by: John E. Bartmess
Electron affinity of neutral species
EAneutral (eV) | Reference | Comment |
---|---|---|
1.79163 | Check, Faust, et al., 2001 | NiH2; ; ΔS(EA)=10.0 |
Protonation reactions
H3Sn- + = H4Sn
Quantity | Value | Units | Method | Reference | Comment |
---|---|---|---|---|---|
ΔrH° | 350.5 ± 2.1 | kcal/mol | G+TS | Gal, Decouzon, et al., 2001 | gas phase |
ΔrH° | 349.40 | kcal/mol | N/A | Check, Faust, et al., 2001 | gas phase; NiH2; ; ΔS(EA)=10.0 |
Quantity | Value | Units | Method | Reference | Comment |
ΔrG° | 342.3 ± 2.0 | kcal/mol | IMRE | Gal, Decouzon, et al., 2001 | gas phase |
ΔrG° | 341.40 | kcal/mol | N/A | Check, Faust, et al., 2001 | gas phase; NiH2; ; ΔS(EA)=10.0 |

References

Check, Faust, et al., 2001
Check, C.E.; Faust, T.O.; Bailey, J.M.; Wright, B.J.; Gilbert, T.M.; Sunderlin, L.S.,
Addition of Polarization and Diffuse Functions to the LANL2DZ Basis Set for P-Block Elements,
J. Phys. Chem. A,, 2001, 105, 34, 8111, https://doi.org/10.1021/jp011945l
. [all data]
Gal, Decouzon, et al., 2001
Gal, J.F.; Decouzon, M.; Maria, P.C.; Gonzalez, A.I.; Mo, O.; Yanez, M.; El Chaouch, S.; Guillemin, J.C.,
Acidity trends in alpha,beta-unsaturated alkanes, silanes, germanes, and stannanes,
J. Am. Chem. Soc., 2001, 123, 26, 6353-6359, https://doi.org/10.1021/ja004079j
. [all data]