CH2=CHSnH2 anion

Reaction thermochemistry data

Data compiled by: John E. Bartmess

Individual Reactions

C2H5Sn- + Hydrogen cation = C2H6Sn

By formula: C2H5Sn- + H+ = C2H6Sn

Quantity Value Units Method Reference Comment
Δr1431. ± 8.4kJ/molIMREGal, Decouzon, et al., 2001gas phase

Gas phase ion energetics data

Data compiled by: John E. Bartmess

Protonation reactions

C2H5Sn- + Hydrogen cation = C2H6Sn

By formula: C2H5Sn- + H+ = C2H6Sn

Quantity Value Units Method Reference Comment
Δr1431. ± 8.4kJ/molIMREGal, Decouzon, et al., 2001gas phase

References

Gal, Decouzon, et al., 2001
Gal, J.F.; Decouzon, M.; Maria, P.C.; Gonzalez, A.I.; Mo, O.; Yanez, M.; El Chaouch, S.; Guillemin, J.C., Acidity trends in alpha,beta-unsaturated alkanes, silanes, germanes, and stannanes, J. Am. Chem. Soc., 2001, 123, 26, 6353-6359, https://doi.org/10.1021/ja004079j . [all data]