EtGeH2 anion

Gas phase ion energetics data

Data compiled by: John E. Bartmess

Protonation reactions

C2H7Ge- + Hydrogen cation = Germane, ethyl-

By formula: C2H7Ge- + H+ = C2H8Ge

Quantity Value Units Method Reference Comment
Δr1532. ± 12.kJ/molG+TSGal, Decouzon, et al., 2001gas phase
Quantity Value Units Method Reference Comment
Δr1500. ± 11.kJ/molIMREGal, Decouzon, et al., 2001gas phase

References

Gal, Decouzon, et al., 2001
Gal, J.F.; Decouzon, M.; Maria, P.C.; Gonzalez, A.I.; Mo, O.; Yanez, M.; El Chaouch, S.; Guillemin, J.C., Acidity trends in alpha,beta-unsaturated alkanes, silanes, germanes, and stannanes, J. Am. Chem. Soc., 2001, 123, 26, 6353-6359, https://doi.org/10.1021/ja004079j . [all data]