CH2=CHSiH2 anion

Gas phase ion energetics data

Data compiled by: John E. Bartmess

Protonation reactions

C2H5Si- + Hydrogen cation = C2H6Si

By formula: C2H5Si- + H+ = C2H6Si

Quantity Value Units Method Reference Comment
Δr1562. ± 9.6kJ/molG+TSGal, Decouzon, et al., 2001gas phase
Quantity Value Units Method Reference Comment
Δr1530. ± 8.4kJ/molIMREGal, Decouzon, et al., 2001gas phase

References

Gal, Decouzon, et al., 2001
Gal, J.F.; Decouzon, M.; Maria, P.C.; Gonzalez, A.I.; Mo, O.; Yanez, M.; El Chaouch, S.; Guillemin, J.C., Acidity trends in alpha,beta-unsaturated alkanes, silanes, germanes, and stannanes, J. Am. Chem. Soc., 2001, 123, 26, 6353-6359, https://doi.org/10.1021/ja004079j . [all data]