ReO2 anion

Gas phase ion energetics data

Data compiled by: John E. Bartmess

Electron affinity of neutral species

EAneutral (eV) Method Reference Comment
2.50 ± 0.10LPESPramann and Rademann, 2001Vertical Detachment Energy: 2.7±0.1 eV

References

Pramann and Rademann, 2001
Pramann, A.; Rademann, K., Photoelectron spectroscopy of ReO2- and ReO3-, Chem. Phys., 2001, 343, 99-104. [all data]