NCCH=C radical anion

Gas phase thermochemistry data

Data compiled by: John E. Bartmess

Quantity Value Units Method Reference Comment
Δfgas<96.00kcal/molIMRBDawson and Jennings, 1976O- + CH2=CHCN ->.

References

Dawson and Jennings, 1976
Dawson, J.H.J.; Jennings, K.R., Production of gas phase radical anions by reaction of O-. Ions with organic substrates, J. Chem. Soc. Faraday Trans. 2, 1976, 72, 700. [all data]