Al2C2 anion

Gas phase thermochemistry data

Data compiled by: John E. Bartmess

Quantity Value Units Method Reference Comment
Δfgas483. ± 40.kJ/molR-EACannon, Boldyrev, et al., 2000Vertical Detachment Energy: 0.71 eV

References

Cannon, Boldyrev, et al., 2000
Cannon, N.A.; Boldyrev, A.I.; Li, X.; Wang, L.S., The electronic structure and chemical bonding of aluminum acetylide: Al2C2 and Al2C2-: An experimental and theoretical investigation, J. Chem. Phys., 2000, 113, 7, 2671-2679, https://doi.org/10.1063/1.1305881 . [all data]