Cu6(CN)6 radical anion

Gas phase ion energetics data

Data compiled by: John E. Bartmess

Electron affinity of neutral species

EAneutral (eV) Method Reference Comment
3.120 ± 0.090LPESNegishi, Yasuike, et al., 2000Vertical Detachment Energy: 3.37±0.08 eV

References

Negishi, Yasuike, et al., 2000
Negishi, Y.; Yasuike, T.; Hayakawa, F.; Kizawa, M.; Yabushita, S.; Nakajima, A.; Kaya, K., Photoelectron spectroscopy of copper cyanide cluster anions: On the possibility of linear and ring structures, J. Chem. Phys., 2000, 113, 5, 1725-1731, https://doi.org/10.1063/1.481974 . [all data]