(mesityl)2C=C(SiMe3)O anion

Reaction thermochemistry data

Data compiled by: John E. Bartmess

Individual Reactions

C23H31OSi- + Hydrogen cation = C23H32OSi

By formula: C23H31OSi- + H+ = C23H32OSi

Quantity Value Units Method Reference Comment
Δr341.0 ± 2.5kcal/molG+TSMishima, Mustanir, et al., 2000gas phase; Keto acidity: 323 K
Quantity Value Units Method Reference Comment
Δr333.9 ± 2.0kcal/molIMREMishima, Mustanir, et al., 2000gas phase; Keto acidity: 323 K

Gas phase ion energetics data

Data compiled by: John E. Bartmess

Protonation reactions

C23H31OSi- + Hydrogen cation = C23H32OSi

By formula: C23H31OSi- + H+ = C23H32OSi

Quantity Value Units Method Reference Comment
Δr341.0 ± 2.5kcal/molG+TSMishima, Mustanir, et al., 2000gas phase; Keto acidity: 323 K
Quantity Value Units Method Reference Comment
Δr333.9 ± 2.0kcal/molIMREMishima, Mustanir, et al., 2000gas phase; Keto acidity: 323 K

References

Mishima, Mustanir, et al., 2000
Mishima, M.; Mustanir; Eventova, I.; Rappoport, Z., Acidities and pK(Enol) values of stable simple enols in the gas phase, J. Chem. Soc. Perkin Trans., 2000, 2, 7, 1505-1512, https://doi.org/10.1039/b001155j . [all data]