(mesityl)2C=C(tBu)O anion

Reaction thermochemistry data

Data compiled by: John E. Bartmess

Individual Reactions

C24H31O- + Hydrogen cation = C24H32O

By formula: C24H31O- + H+ = C24H32O

Quantity Value Units Method Reference Comment
Δr343.6 ± 2.5kcal/molG+TSMishima, Mustanir, et al., 2000gas phase; Keto acidity; enol acidity=334.7: 323 K
Quantity Value Units Method Reference Comment
Δr336.5 ± 2.0kcal/molIMREMishima, Mustanir, et al., 2000gas phase; Keto acidity; enol acidity=334.7: 323 K

Gas phase ion energetics data

Data compiled by: John E. Bartmess

Protonation reactions

C24H31O- + Hydrogen cation = C24H32O

By formula: C24H31O- + H+ = C24H32O

Quantity Value Units Method Reference Comment
Δr343.6 ± 2.5kcal/molG+TSMishima, Mustanir, et al., 2000gas phase; Keto acidity; enol acidity=334.7: 323 K
Quantity Value Units Method Reference Comment
Δr336.5 ± 2.0kcal/molIMREMishima, Mustanir, et al., 2000gas phase; Keto acidity; enol acidity=334.7: 323 K

References

Mishima, Mustanir, et al., 2000
Mishima, M.; Mustanir; Eventova, I.; Rappoport, Z., Acidities and pK(Enol) values of stable simple enols in the gas phase, J. Chem. Soc. Perkin Trans., 2000, 2, 7, 1505-1512, https://doi.org/10.1039/b001155j . [all data]