(mesityl)2C=C(Me)O anion

Gas phase ion energetics data

Data compiled by: John E. Bartmess

Protonation reactions

C21H25O- + Hydrogen cation = 1-Propen-2-ol, 1,1-bis(2,4,6-trimethylphenyl)-

By formula: C21H25O- + H+ = C21H26O

Quantity Value Units Method Reference Comment
Δr1433. ± 10.kJ/molG+TSMishima, Mustanir, et al., 2000gas phase; Keto acidity: 323 K
Quantity Value Units Method Reference Comment
Δr1403. ± 8.4kJ/molIMREMishima, Mustanir, et al., 2000gas phase; Keto acidity: 323 K

References

Mishima, Mustanir, et al., 2000
Mishima, M.; Mustanir; Eventova, I.; Rappoport, Z., Acidities and pK(Enol) values of stable simple enols in the gas phase, J. Chem. Soc. Perkin Trans., 2000, 2, 7, 1505-1512, https://doi.org/10.1039/b001155j . [all data]