CD2 radical anion

Gas phase thermochemistry data

Data compiled by: John E. Bartmess

Quantity Value Units Method Reference Comment
Δfgas327.7 ± 1.0kJ/molR-EALeopold, Murray, et al., 1985

References

Leopold, Murray, et al., 1985
Leopold, D.G.; Murray, K.K.; Miller, A.E.S.; Lineberger, W.C., Methylene: A study of the X3B1 and the 1A1 states by photoelectron spectroscopy of CH2- and CD2-, J. Chem. Phys., 1985, 83, 4849. [all data]